Climate and Forecast Standard Names
type: ConceptScheme
has top concept: water_evaporation_amount

water_evaporation_amount
type: Concept
top concept of: Climate and Forecast Standard Names
source: cf-standard-name-table.html
in scheme: Climate and Forecast Standard Names
definition: "Amount" means mass per unit area. "Water" means water in all phases. Evaporation is the conversion of liquid or solid into vapor. (The conversion of solid alone into vapor is called "sublimation".)