Climate and Forecast Standard Names
type: ConceptScheme
has top concept: vegetation_mass_content_of_nitrogen

vegetation_mass_content_of_nitrogen
type: Concept
top concept of: Climate and Forecast Standard Names
note: Mapping to be determined
source: cf-standard-name-table.html
in scheme: Climate and Forecast Standard Names
definition: "Content" indicates a quantity per unit area. "Vegetation" means any living plants e.g. trees, shrubs, grass. The term "plants" refers to the kingdom of plants in the modern classification which excludes fungi. Plants are autotrophs i.e. "producers" of biomass using carbon obtained from carbon dioxide.