Climate and Forecast Standard Names
type: ConceptScheme
has top concept: tendency_of_air_density

tendency_of_air_density
type: Concept
top concept of: Climate and Forecast Standard Names
note: Mapping to be determined
source: cf-standard-name-table.html
in scheme: Climate and Forecast Standard Names
definition: 'tendency_of_X' means derivative of X with respect to time.