Climate and Forecast Standard Names
type: ConceptScheme
has top concept: significant_height_of_swell_waves

significant_height_of_swell_waves
type: Concept
is replaced by: sea_surface_swell_wave_significant_height
in scheme: Climate and Forecast Standard Names
definition: Height is the vertical distance above the surface. Swell waves are waves on the ocean surface.
note: deprecated
top concept of: Climate and Forecast Standard Names
source: cf-standard-name-table.html
deprecated: true

sea_surface_swell_wave_significant_height
type: Concept