Climate and Forecast Standard Names
type: ConceptScheme
has top concept: sea_water_volume

sea_water_volume
type: Concept
top concept of: Climate and Forecast Standard Names
note: Mapping to be determined
source: cf-standard-name-table.html
in scheme: Climate and Forecast Standard Names
definition: The quantity with standard name "sea_water_volume" is the total volume of liquid seawater in the global oceans, including enclosed seas.