Climate and Forecast Standard Names
type: ConceptScheme
has top concept: sea_water_velocity_from_direction

sea_water_velocity_from_direction
type: Concept
replaces: sea water from direction
top concept of: Climate and Forecast Standard Names
note: Mapping to be determined
source: cf-standard-name-table.html
in scheme: Climate and Forecast Standard Names
definition: A velocity is a vector quantity. The phrase "from_direction" is used in the construction X_from_direction and indicates the direction from which the velocity vector of X is coming. The direction is a bearing in the usual geographical sense, measured positive clockwise from due north.