sea_water_redistributed_conservative_temperature
type: Concept
top concept of: Climate and Forecast Standard Names
note: Mapping to be determined
source: cf-standard-name-table.html
in scheme: Climate and Forecast Standard Names
definition: The quantity with standard name sea_water_redistributed_conservative_temperature is a passive tracer in an ocean model which is subject to an externally imposed perturbative surface heat flux. The passive tracer is initialised to the conservative temperature in the control climate before the perturbation is imposed. Its surface flux is the heat flux from the atmosphere, not including the imposed perturbation, and is converted to a passive tracer increment as if it were being added to conservative temperature. The passive tracer is transported within the ocean as if it were conservative temperature. The passive tracer records redistributed heat, as described for the CMIP6 FAFMIP experiment (doi:10.5194/gmd-9-3993-2016), following earlier ideas. Conservative Temperature is defined as part of the Thermodynamic Equation of Seawater 2010 (TEOS-10) which was adopted in 2010 by the International Oceanographic Commission (IOC). Conservative Temperature is specific potential enthalpy (which has the standard name sea_water_specific_potential_enthalpy) divided by a fixed value of the specific heat capacity of sea water, namely cp_0 = 3991.86795711963 J kg-1 K-1. Conservative Temperature is a more accurate measure of the "heat content" of sea water, by a factor of one hundred, than is potential temperature. Because of this, it can be regarded as being proportional to the heat content of sea water per unit mass. Reference: www.teos-10.org; McDougall, 2003 doi: 10.1175/1520-0485(2003)033<0945:PEACOV>2.0.CO;2.

Climate and Forecast Standard Names
type: ConceptScheme
has top concept: sea_water_redistributed_conservative_temperature