sea_surface_wave_mean_period
type: Concept

Climate and Forecast Standard Names
type: ConceptScheme
has top concept: sea_surface_wave_zero_upcrossing_period

sea_surface_wave_zero_upcrossing_period
type: Concept
in scheme: Climate and Forecast Standard Names
is replaced by: sea_surface_wave_mean_period
definition: A period is an interval of time, or the time-period of an oscillation. The zero upcrossing period is defined as the time interval between consecutive occasions on which the surface height passes upward above the mean level.
source: cf-standard-name-table.html
top concept of: Climate and Forecast Standard Names
deprecated: true
note: deprecated