Climate and Forecast Standard Names
type: ConceptScheme
has top concept: sea_surface_wave_mean_square_slope

sea_surface_wave_mean_square_slope
type: Concept
top concept of: Climate and Forecast Standard Names
note: Mapping to be determined
source: cf-standard-name-table.html
in scheme: Climate and Forecast Standard Names
definition: Wave slope describes an aspect of sea surface wave geometry related to sea surface roughness. Mean square slope describes a derivation over multiple waves within a sea-state, for example calculated from moments of the wave directional spectrum.