sea_surface_height_above_mean_sea_level
type: Concept

sea_surface_height_above_sea_level
type: Concept
definition: sea_level means mean sea level, which is close to the geoid in sea areas. 'Sea surface height' is a time-varying quantity. The standard name for the height of the sea surface above the geoid is sea_surface_height_above_geoid.
is replaced by: sea_surface_height_above_mean_sea_level
in scheme: Climate and Forecast Standard Names
source: cf-standard-name-table.html
note: deprecated
top concept of: Climate and Forecast Standard Names
deprecated: true

Climate and Forecast Standard Names
type: ConceptScheme
has top concept: sea_surface_height_above_sea_level