Climate and Forecast Standard Names
type: ConceptScheme
has top concept: sea_surface_density

sea_surface_density
type: Concept
top concept of: Climate and Forecast Standard Names
note: Mapping to be determined
source: cf-standard-name-table.html
in scheme: Climate and Forecast Standard Names
definition: Sea surface density is the density of sea water near the surface (including the part under sea-ice, if any).