Climate and Forecast Standard Names
type: ConceptScheme
has top concept: sea_ice_thickness

sea_ice_thickness
type: Concept
top concept of: Climate and Forecast Standard Names
source: cf-standard-name-table.html
in scheme: Climate and Forecast Standard Names
definition: "Thickness" means the vertical extent of a layer. "Sea ice" means all ice floating in the sea which has formed from freezing sea water, rather than by other processes such as calving of land ice to form icebergs.