Climate and Forecast Standard Names
type: ConceptScheme
has top concept: sea_ice_extent

sea_ice_extent
type: Concept
top concept of: Climate and Forecast Standard Names
in scheme: Climate and Forecast Standard Names
source: cf-standard-name-table.html
definition: The term sea_ice_extent means the total area of all grid cells in which the sea ice area fraction equals or exceeds a threshold, often chosen to be 15 per cent. The threshold must be specified by supplying a coordinate variable or scalar coordinate variable with the standard name of sea_ice_area_fraction. The horizontal domain over which sea ice extent is calculated is described by the associated coordinate variables and coordinate bounds or by a coordinate variable or scalar coordinate variable with the standard name of "region" supplied according to section 6.1.1 of the CF conventions. "Sea ice" means all ice floating in the sea which has formed from freezing sea water, rather than by other processes such as calving of land ice to form icebergs.