Climate and Forecast Standard Names
type: ConceptScheme
has top concept: sea_floor_depth_below_geoid

sea_floor_depth_below_geoid
type: Concept
replaces: sea floor depth
top concept of: Climate and Forecast Standard Names
note: Mapping to be determined
source: cf-standard-name-table.html
in scheme: Climate and Forecast Standard Names
definition: "Depth_below_X" means the vertical distance below the named surface X. The geoid is a surface of constant geopotential with which mean sea level would coincide if the ocean were at rest. (The volume enclosed between the geoid and the sea floor equals the mean volume of water in the ocean). In an ocean GCM the geoid is the surface of zero depth, or the rigid lid if the model uses that approximation. To specify which geoid or geopotential datum is being used as a reference level, a grid_mapping variable should be attached to the data variable as described in Chapter 5.6 of the CF Convention.