Climate and Forecast Standard Names
type: ConceptScheme
has top concept: radioactivity_concentration_of_103mRh_in_air

radioactivity_concentration_of_103mRh_in_air
type: Concept
top concept of: Climate and Forecast Standard Names
note: Mapping to be determined
source: cf-standard-name-table.html
in scheme: Climate and Forecast Standard Names
definition: "Radioactivity" means the number of radioactive decays of a material per second. "Radioactivity concentration" means radioactivity per unit volume of the medium. "Rh" means the element "rhodium" and "103mRh" is the metastable state of the isotope "rhodium-103" with a half-life of 3.89e-02 days.