platform_yaw_fore_port
type: Concept
top concept of: Climate and Forecast Standard Names
note: Mapping to be determined
source: cf-standard-name-table.html
in scheme: Climate and Forecast Standard Names
definition: Yaw is a rotation about the local vertical axis. Yaw is relative to the "at rest" rotation of the platform with respect to the axis of rotation. The "at rest" rotation of the platform may change over time. "Fore port" indicates that positive values of yaw represent the front of the platform moving to the left as viewed by an observer on top of the platform facing forward. The standard name platform_yaw_fore_starboard should be used for data having the opposite sign convention. The standard name platform_yaw should be chosen only if the sign convention of the data is unknown. A "platform" is a structure or vehicle that serves as a base for mounting sensors. Platforms include, but are not limited to, satellites, aeroplanes, ships, buoys, instruments, ground stations, and masts.

Climate and Forecast Standard Names
type: ConceptScheme
has top concept: platform_yaw_fore_port