Climate and Forecast Standard Names
type: ConceptScheme
has top concept: photolysis_rate_of_molecular_oxygen

photolysis_rate_of_molecular_oxygen
type: Concept
top concept of: Climate and Forecast Standard Names
note: Mapping to be determined
source: cf-standard-name-table.html
in scheme: Climate and Forecast Standard Names
definition: "Photolysis" is a chemical reaction in which a chemical compound is broken down by photons. The "reaction rate" is the rate at which the reactants of a chemical reaction form the products. The chemical formula for molecular oxygen is O2.