Climate and Forecast Standard Names
type: ConceptScheme
has top concept: ocean_y_overturning_mass_streamfunction

ocean_y_overturning_mass_streamfunction
type: Concept
top concept of: Climate and Forecast Standard Names
note: Mapping to be determined
source: cf-standard-name-table.html
in scheme: Climate and Forecast Standard Names
definition: "y" indicates a vector component along the grid y-axis, positive with increasing y. In contrast to the quantity with standard name ocean_meridional_overturning_streamfunction, this quantity includes all physical processes, resolved or parameterized, that impact mass/volume transport. Thus it includes contributions from the parameterized eddy velocity.