Climate and Forecast Standard Names
type: ConceptScheme
has top concept: ocean_vertical_heat_diffusivity

ocean_vertical_heat_diffusivity
type: Concept
top concept of: Climate and Forecast Standard Names
note: Mapping to be determined
source: cf-standard-name-table.html
in scheme: Climate and Forecast Standard Names
definition: "Vertical heat diffusivity" means the vertical component of the diffusivity of heat due to motion which is not resolved on the grid scale of the model.