Climate and Forecast Standard Names
type: ConceptScheme
has top concept: ocean_rigid_lid_pressure

ocean_rigid_lid_pressure
type: Concept
top concept of: Climate and Forecast Standard Names
note: Mapping to be determined
source: cf-standard-name-table.html
in scheme: Climate and Forecast Standard Names
definition: "Ocean rigid lid pressure" means the pressure at the surface of an ocean model assuming that it is bounded above by a rigid lid.