Climate and Forecast Standard Names
type: ConceptScheme
has top concept: lwe_thickness_of_convective_snowfall_amount

lwe_thickness_of_convective_snowfall_amount
type: Concept
top concept of: Climate and Forecast Standard Names
note: Mapping to be determined
source: cf-standard-name-table.html
in scheme: Climate and Forecast Standard Names
definition: 'lwe' means liquid water equivalent. 'Amount' means mass per unit area. The construction lwe_thickness_of_X_amount or _content means the vertical extent of a layer of liquid water having the same mass per unit area.