Climate and Forecast Standard Names
type: ConceptScheme
has top concept: land_ice_thickness

land_ice_thickness
type: Concept
top concept of: Climate and Forecast Standard Names
note: Mapping to be determined
source: cf-standard-name-table.html
in scheme: Climate and Forecast Standard Names
definition: "Land ice" means glaciers, ice-caps and ice-sheets resting on bedrock and also includes ice-shelves. "Thickness" means the vertical extent of a layer.