Climate and Forecast Standard Names
type: ConceptScheme
has top concept: height_at_cloud_top

height_at_cloud_top
type: Concept
top concept of: Climate and Forecast Standard Names
note: Mapping to be determined
source: cf-standard-name-table.html
in scheme: Climate and Forecast Standard Names
definition: cloud_top refers to the top of the highest cloud. Height is the vertical distance above the surface.