Climate and Forecast Standard Names
type: ConceptScheme
has top concept: height_above_geopotential_datum

height_above_geopotential_datum
type: Concept
top concept of: Climate and Forecast Standard Names
note: Mapping to be determined
source: cf-standard-name-table.html
in scheme: Climate and Forecast Standard Names
definition: "Height_above_X" means the vertical distance above the named surface X. The "geopotential datum" is any estimated surface of constant geopotential used as a datum i.e. a reference level; for the geoid as a datum, specific standard names are available. To specify which geoid or geopotential datum is being used as a reference level, a grid_mapping variable should be attached to the data variable as described in Chapter 5.6 of the CF Convention.