Climate and Forecast Standard Names
type: ConceptScheme
has top concept: flood_water_thickness

flood_water_thickness
type: Concept
top concept of: Climate and Forecast Standard Names
note: Mapping to be determined
source: cf-standard-name-table.html
in scheme: Climate and Forecast Standard Names
definition: The flood_water_thickness is the vertical distance between the surface of the flood water and the surface of the solid ground, as measured at a given point in space. The standard name ground_level_altitude is used for a data variable giving the geometric height of the ground surface above the geoid. "Flood water" is water that covers land which is normally not covered by water.