Climate and Forecast Standard Names
type: ConceptScheme
has top concept: electromagnetic_wavelength

electromagnetic_wavelength
type: Concept
top concept of: Climate and Forecast Standard Names
note: deprecated
definition: The radiation wavelength can refer to any electromagnetic wave, such as light, heat radiation and radio waves.
deprecated: true
is replaced by: radiation_wavelength
in scheme: Climate and Forecast Standard Names
source: cf-standard-name-table.html

radiation_wavelength
type: Concept