convective_snowfall_flux
type: Concept
top concept of: Climate and Forecast Standard Names
note: Mapping to be determined
source: cf-standard-name-table.html
in scheme: Climate and Forecast Standard Names
definition: In accordance with common usage in geophysical disciplines, 'flux' implies per unit area, called 'flux density' in physics.

Climate and Forecast Standard Names
type: ConceptScheme
has top concept: convective_snowfall_flux