Climate and Forecast Standard Names
type: ConceptScheme
has top concept: convective_cloud_top_altitude

convective_cloud_top_altitude
type: Concept
top concept of: Climate and Forecast Standard Names
note: Mapping to be determined
source: cf-standard-name-table.html
in scheme: Climate and Forecast Standard Names
definition: cloud_top refers to the top of the highest cloud. Altitude is the (geometric) height above the geoid, which is the reference geopotential surface. The geoid is similar to mean sea level. Convective cloud is that produced by the convection schemes in an atmosphere model.