Climate and Forecast Standard Names
type: ConceptScheme
has top concept: convection_time_fraction

convection_time_fraction
type: Concept
top concept of: Climate and Forecast Standard Names
note: Mapping to be determined
source: cf-standard-name-table.html
in scheme: Climate and Forecast Standard Names
definition: "Time fraction" means a fraction of a time interval. The interval in question must be specified by the values or bounds of the time coordinate variable associated with the data. "X_time_fraction" means the fraction of the time interval during which X occurs.