Climate and Forecast Standard Names
type: ConceptScheme
has top concept: cloud_ice_mixing_ratio

cloud_ice_mixing_ratio
type: Concept
top concept of: Climate and Forecast Standard Names
note: Mapping to be determined
source: cf-standard-name-table.html
in scheme: Climate and Forecast Standard Names
definition: Cloud ice mixing ratio of a parcel of air is the ratio of the mass of ice to the mass of dry air.