canopy_height
type: Concept
top concept of: Climate and Forecast Standard Names
note: Mapping to be determined
source: cf-standard-name-table.html
in scheme: Climate and Forecast Standard Names
definition: Height is the vertical distance above the surface. "Canopy" means the vegetative covering over a surface. The canopy is often considered to be the outer surfaces of the vegetation. Plant height and the distribution, orientation and shape of plant leaves within a canopy influence the atmospheric environment and many plant processes within the canopy. Reference: AMS Glossary http://glossary.ametsoc.org/wiki/Canopy.

Climate and Forecast Standard Names
type: ConceptScheme
has top concept: canopy_height