burned_area_fraction
type: Concept
top concept of: Climate and Forecast Standard Names
note: Mapping to be determined
source: cf-standard-name-table.html
in scheme: Climate and Forecast Standard Names
definition: "Area fraction" is the fraction of a grid cell's horizontal area that has some characteristic of interest. It is evaluated as the area of interest divided by the grid cell area. It may be expressed as a fraction, a percentage, or any other dimensionless representation of a fraction. "Burned area" means the area of burned vegetation.

Climate and Forecast Standard Names
type: ConceptScheme
has top concept: burned_area_fraction