Climate and Forecast Standard Names
type: ConceptScheme
has top concept: barometric_altitude

barometric_altitude
type: Concept
top concept of: Climate and Forecast Standard Names
source: cf-standard-name-table.html
in scheme: Climate and Forecast Standard Names
definition: Barometric altitude is the altitude determined by a pressure measurement which is converted to altitude through interpolation of the International Standard Atmosphere (ICAO, 1976). A mean sea level pressure of 1013.25 hPa is used for the surface pressure.