Climate and Forecast Standard Names
type: ConceptScheme
has top concept: atmosphere_moles_of_acetic_acid

atmosphere_moles_of_acetic_acid
type: Concept
top concept of: Climate and Forecast Standard Names
note: Mapping to be determined
source: cf-standard-name-table.html
in scheme: Climate and Forecast Standard Names
definition: The construction "atmosphere_moles_of_X" means the total number of moles of X in the entire atmosphere, i.e. summed over the atmospheric column and over the entire globe. The chemical formula for acetic_acid is CH3COOH. The IUPAC name for acetic acid is ethanoic acid.