Climate and Forecast Standard Names
type: ConceptScheme
has top concept: atmosphere_mass_content_of_benzene

atmosphere_mass_content_of_benzene
type: Concept
top concept of: Climate and Forecast Standard Names
note: Mapping to be determined
source: cf-standard-name-table.html
in scheme: Climate and Forecast Standard Names
definition: "Content" indicates a quantity per unit area. The "atmosphere content" of a quantity refers to the vertical integral from the surface to the top of the atmosphere. For the content between specified levels in the atmosphere, standard names including content_of_atmosphere_layer are used. The chemical formula for benzene is C6H6. Benzene is the simplest aromatic hydrocarbon and has a ring structure consisting of six carbon atoms joined by alternating single and double chemical bonds. Each carbon atom is additionally bonded to one hydrogen atom. There are standard names that refer to aromatic_compounds as a group, as well as those for individual species.