Climate and Forecast Standard Names
type: ConceptScheme
has top concept: altitude

altitude
type: Concept
top concept of: Climate and Forecast Standard Names
source: cf-standard-name-table.html
in scheme: Climate and Forecast Standard Names
definition: Altitude is the (geometric) height above the geoid, which is the reference geopotential surface. The geoid is similar to mean sea level.