Climate and Forecast Standard Names
type: ConceptScheme
has top concept: air_pressure_at_convective_cloud_base

air_pressure_at_convective_cloud_base
type: Concept
top concept of: Climate and Forecast Standard Names
note: Mapping to be determined
source: cf-standard-name-table.html
in scheme: Climate and Forecast Standard Names
definition: The phrase "cloud_base" refers to the base of the lowest cloud. Convective cloud is that produced by the convection schemes in an atmosphere model. Air pressure is the force per unit area which would be exerted when the moving gas molecules of which the air is composed strike a theoretical surface of any orientation.