Climate and Forecast Standard Names
type: ConceptScheme
has top concept: temperature_in_ground

temperature_in_ground
type: Concept
replaces: solid earth subsurface temperature
source: cf-standard-name-table.html
definition: The temperature at any given depth (or in a layer) below the surface of the ground, excluding surficial snow and ice (but not permafrost or soil). For temperatures in surface lying snow and ice, the more specific standard names temperature_in_surface_snow and land_ice_temperature should be used. For temperatures measured or modelled specifically for the soil layer (the near-surface layer where plants sink their roots) the standard name soil_temperature should be used.
in scheme: Climate and Forecast Standard Names
note: Mapping to be determined
top concept of: Climate and Forecast Standard Names