Climate and Forecast Standard Names
type: ConceptScheme
has top concept: shallow_convective_precipitation_flux

shallow_convective_precipitation_flux
type: Concept
source: cf-standard-name-table.html
definition: Convective precipitation is that produced by the convection schemes in an atmosphere model. Some atmosphere models differentiate between shallow and deep convection. "Precipitation" in the earth's atmosphere means precipitation of water in all phases. In accordance with common usage in geophysical disciplines, "flux" implies per unit area, called "flux density" in physics.
in scheme: Climate and Forecast Standard Names
note: Mapping to be determined
top concept of: Climate and Forecast Standard Names