Climate and Forecast Standard Names
type: ConceptScheme
has top concept: sensor_band_central_radiation_wavenumber

sensor_band_central_radiation_wavenumber
type: Concept
source: cf-standard-name-table.html
definition: sensor_band_central_radiation_wavenumber is the central wavenumber of a sensor's band, calculated as the first moment of the band's normalized spectral response function.
in scheme: Climate and Forecast Standard Names
note: Mapping to be determined
top concept of: Climate and Forecast Standard Names