Climate and Forecast Standard Names
type: ConceptScheme
has top concept: secchi_depth_of_sea_water

secchi_depth_of_sea_water
type: Concept
source: cf-standard-name-table.html
definition: Depth is the vertical distance below the surface. A Secchi disk is a patterned disk that is used to measure water transparency, also called turbidity, in oceans and lakes. The disk is lowered into the water and the depth at which the pattern is no longer visible is the called the secchi depth. Sea water turbidity may also be measured by the quantity with standard name sea_water_turbidity.
in scheme: Climate and Forecast Standard Names
note: Mapping to be determined
top concept of: Climate and Forecast Standard Names