Climate and Forecast Standard Names
type: ConceptScheme
has top concept: sea_water_to_direction

sea_water_to_direction
type: Concept
is replaced by: sea_water_velocity_to_direction
source: cf-standard-name-table.html
deprecated: true
definition: The phrase "to_direction" is used in the construction X_to_direction and indicates the direction towards which the velocity vector of X is headed. The direction is a bearing in the usual geographical sense, measured positive clockwise from due north.
in scheme: Climate and Forecast Standard Names
note: deprecated
top concept of: Climate and Forecast Standard Names

sea_water_velocity_to_direction
type: Concept