Climate and Forecast Standard Names
type: ConceptScheme
has top concept: sea_water_temperature_at_sea_floor

sea_water_temperature_at_sea_floor
type: Concept
source: cf-standard-name-table.html
definition: Sea water temperature is the in situ temperature of the sea water. The temperature at the sea floor is that adjacent to the ocean bottom, which would be the deepest grid cell in an ocean model and within the benthic boundary layer for measurements.
in scheme: Climate and Forecast Standard Names
note: Mapping to be determined
top concept of: Climate and Forecast Standard Names