Climate and Forecast Standard Names
type: ConceptScheme
has top concept: sea_water_temperature_anomaly

sea_water_temperature_anomaly
type: Concept
source: cf-standard-name-table.html
definition: The term "anomaly" means difference from climatology. Sea water temperature is the in situ temperature of the sea water. To specify the depth at which the temperature anomaly applies, use a vertical coordinate variable or scalar coordinate variable.
in scheme: Climate and Forecast Standard Names
note: Mapping to be determined
top concept of: Climate and Forecast Standard Names