Climate and Forecast Standard Names
type: ConceptScheme
has top concept: sea_water_pressure_at_sea_floor

sea_water_pressure_at_sea_floor
type: Concept
source: cf-standard-name-table.html
definition: "Sea water pressure" is the pressure that exists in the medium of sea water. It includes the pressure due to overlying sea water, sea ice, air and any other medium that may be present.
in scheme: Climate and Forecast Standard Names
note: Mapping to be determined
top concept of: Climate and Forecast Standard Names