Climate and Forecast Standard Names
type: ConceptScheme
has top concept: sea_water_pressure

sea_water_pressure
type: Concept
source: cf-standard-name-table.html
definition: "Sea water pressure" is the pressure that exists in the medium of sea water. It includes the pressure due to overlying sea water, sea ice, air and any other medium that may be present. For sea water pressure excluding the pressure due to overlying media other than sea water, the standard name sea_water_pressure_due_to_sea_water should be used.
in scheme: Climate and Forecast Standard Names
top concept of: Climate and Forecast Standard Names