Climate and Forecast Standard Names
type: ConceptScheme
has top concept: sea_water_age_since_surface_contact

sea_water_age_since_surface_contact
type: Concept
source: cf-standard-name-table.html
definition: "Sea water age since surface contact" means the length of time elapsed since the sea water in a grid cell was last in the surface level of an ocean model.
in scheme: Climate and Forecast Standard Names
note: Mapping to be determined
top concept of: Climate and Forecast Standard Names