Climate and Forecast Standard Names
type: ConceptScheme
has top concept: sea_surface_wave_mean_height

sea_surface_wave_mean_height
type: Concept
source: cf-standard-name-table.html
definition: Wave height is defined as the vertical distance from a wave trough to the following wave crest. The mean wave height is the mean trough to crest distance measured during the observation period.
in scheme: Climate and Forecast Standard Names
note: Mapping to be determined
top concept of: Climate and Forecast Standard Names