Climate and Forecast Standard Names
type: ConceptScheme
has top concept: sea_surface_wave_maximum_period

sea_surface_wave_maximum_period
type: Concept
source: cf-standard-name-table.html
definition: The maximum wave period is the longest wave period measured during the observation period. A period is an interval of time, or the time-period of an oscillation. Wave period is the interval of time between repeated features on the waveform such as crests, troughs or upward passes through the mean level.
in scheme: Climate and Forecast Standard Names
note: Mapping to be determined
top concept of: Climate and Forecast Standard Names