Climate and Forecast Standard Names
type: ConceptScheme
has top concept: sea_surface_swell_wave_period

sea_surface_swell_wave_period
type: Concept
replaces: swell wave period
source: cf-standard-name-table.html
definition: A period is an interval of time, or the time-period of an oscillation. Swell waves are waves on the ocean surface.
in scheme: Climate and Forecast Standard Names
note: Mapping to be determined
top concept of: Climate and Forecast Standard Names